{"text_format":"1","workbook":"xlsx","n_sheets":27,"sheets":["Lookup_Tables","Grid_Extension_Cost","Generation_Distribution","Load_Profiling","Inputs-REC","Inputs","Introduction","Inputs&Summary","Scenarios","Tariff Chart","Tariff Breakup Chart","Sensitivity Chart","Off-Grid Sensitivity","Sensitivity","REC-FIT","Term Loan 1","Term Loan 2","Fuel","Depreciation","W Capital","Tariff","Carbon","Profit Loss","Cash Flows","Balance Sheet","IRR","DSCR"],"not_rendered":{"charts":9,"images":4,"macros":1,"external_links":0,"defined_names":36,"comments":7,"pivot_tables":0},"unopened":[{"sheet":"Tariff Chart","index":9,"reason":"not_a_worksheet"},{"sheet":"Tariff Breakup Chart","index":10,"reason":"not_a_worksheet"},{"sheet":"Sensitivity Chart","index":11,"reason":"not_a_worksheet"}],"bounds":{"document_bytes":16777216,"sheet_cells":100000,"rows_first":2000,"rows_last":500,"rows_between":2000,"halvings":0,"cell_chars":16384,"cell_head_chars":4096},"cells_cut":0,"cells_raw":0,"read":"whole","date_system":"1900"}

{"sheet":"Lookup_Tables","index":0,"n_rows":54,"n_cols":8,"rows_kept":54,"cut":false,"hidden":false,"merged":[[0,5,0,7],[0,1,0,2]]}
[null,"LookUpTables",null,null,null,"Inputs for Grid Extension Calculation"]
[null,"Form Inputs Off Grid",null,null,null,"Form Inputs Grid Extension"]
[null,"No. of HH",{"$f":"'Inputs&Summary'!D24","v":100},null,null,"Number of 3 ph Con",{"$f":"SUM(Load_Profiling!D20:D23)","v":4}]
[null,"Location",{"$f":"VLOOKUP('Inputs&Summary'!D17,B9:C11,2,FALSE)","v":1},null,null,"Number of 1 Ph Con",{"$f":"C3","v":100}]
[null,"Density",{"$f":"VLOOKUP('Inputs&Summary'!D18,B14:C16,2,FALSE)","v":3},null,null,"Total Demand 1 Ph (kWh)",{"$f":"ROUNDUP(SUM(Load_Profiling!H6:H11,Load_Profiling!H14:H17)/1000,0)","v":15}]
[null,"Solar PV Insolation",{"$f":"VLOOKUP(\"*\"&StateIP&\"*\",Lookup_Tables!$B$19:$C$24,2,FALSE)","v":5.5},null,null,"Total Demand 3 Ph (kWh)",{"$f":"ROUNDUP(Load_Profiling!H25/1000,0)","v":61}]
[]
[null,"Location List"]
{"$rows_left_out":47}
{"sheet":"Grid_Extension_Cost","index":1,"n_rows":56,"n_cols":52,"rows_kept":56,"cut":false,"hidden":false,"merged":[]}
[]
[null,"Distribution System","Three Phase","Single Phase"]
[null,"Infrastructure Cost"]
[null,"11 kV Line",{"$f":"Lookup_Tables!$G$10*Lookup_Tables!$G$11","v":750000},{"$f":"Lookup_Tables!$G$10*Lookup_Tables!$G$11","v":750000}]
[null,"DTC",{"$f":"(Lookup_Tables!G16*Lookup_Tables!G17)*10^5","v":249000.00000000003},{"$f":"(Lookup_Tables!H16*Lookup_Tables!H17)*10^5","v":184500}]
[null,"LT Line",{"$f":"Lookup_Tables!$G$25*Lookup_Tables!$G$26","v":128000},{"$f":"Lookup_Tables!$G$25*Lookup_Tables!$G$26","v":128000}]
[null,"Connections",{"$f":"Lookup_Tables!$G$4*Lookup_Tables!$G$30+Lookup_Tables!$G$3*Lookup_Tables!$G$31","v":264560},{"$f":"Lookup_Tables!$G$4*Lookup_Tables!$G$30+Lookup_Tables!$G$3*Lookup_Tables!$G$31","v":264560}]
[]
{"$rows_left_out":49}
{"sheet":"Generation_Distribution","index":2,"n_rows":70,"n_cols":13,"rows_kept":70,"cut":false,"hidden":false,"merged":[]}
[null,"Plant Installation Costs","Solar PV","Biomass Gassifier","Micro Hydro",null,null,"Off Grid calculator - Power distribution & service connection ","Solar PV","Biomass Gassifier","Micro Hydro"]
[]
[null,"Use factor (average energy usage / maximum energy usage)",0.9,null,null,null,null,"Basis"]
[null,"Plant Size"]
[null,"Total Energy Demand",{"$f":"ROUNDUP(Load_Profiling!H25/1000,1)","v":60.300000000000004},{"$f":"ROUNDUP(Load_Profiling!H25/1000,1)","v":60.300000000000004},{"$f":"ROUNDUP(Load_Profiling!H25/1000,1)","v":60.300000000000004},null,1,"PSC Pole (8m, 200 kg) - average cost",4000,4000,4000]
[null,"Day Time Demand",{"$f":"ROUNDUP(Load_Profiling!H27/1000,1)","v":52.1},{"$f":"ROUNDUP(Load_Profiling!H27/1000,1)","v":52.1},{"$f":"ROUNDUP(Load_Profiling!H27/1000,1)","v":52.1},null,2,"RSJ Pole (8m, 125 x 70) - average cost",5000,5000,5000]
[null,"Night Time Demand",{"$f":"ROUNDUP(Load_Profiling!H28/1000,1)","v":8.2999999999999989},{"$f":"ROUNDUP(Load_Profiling!H28/1000,1)","v":8.2999999999999989},{"$f":"ROUNDUP(Load_Profiling!H28/1000,1)","v":8.2999999999999989},null,3,"LT stay unit rate",3000,3000,3000]
[null,"Maximum Day time usage (hrs)",{"$f":"MAX(Load_Profiling!F6:F11,Load_Profiling!F14:F17,Load_Profiling!F20:F23)","v":4},{"$f":"MAX(Load_Profiling!F6:F11,Load_Profiling!F14:F17,Load_Profiling!F20:F23)","v":4},{"$f":"MAX(Load_Profiling!F6:F11,Load_Profiling!F14:F17,Load_Profiling!F20:F23)","v":4},null,4,"Hardware rate",1500,1500,1500]
{"$rows_left_out":63}
{"sheet":"Load_Profiling","index":3,"n_rows":29,"n_cols":10,"rows_kept":29,"cut":false,"hidden":false,"merged":[]}
[]
[]
[null,null,"Electrical load demand","User","Watt","Day Time Use","Night Time Use","Total Watt Hr"]
[]
[null,null,"Domestic"]
[null,null,"Light (type 1)",{"$f":"Lookup_Tables!C3","v":100},4,2,{"$f":"IF(Lookup_Tables!C4>2, 5, 3)","v":3},{"$f":"(D6*E6*F6)+(D6*E6*G6)","v":2000}]
[null,null,"Light (type 2)",{"$f":"ROUNDUP(0.5*Lookup_Tables!C3,0)","v":50},2,0,4,400]
[null,null,"Mobile charger",{"$f":"IF(Lookup_Tables!C6>5.5,ROUNDUP(0.5*Lookup_Tables!C3,0),0.1*Lookup_Tables!C3)","v":10},3,3,3,180]
{"$rows_left_out":22}
{"sheet":"Inputs-REC","index":4,"n_rows":77,"n_cols":19,"rows_kept":77,"cut":false,"hidden":false,"merged":[[1,3,1,4],[1,5,1,6],[1,7,1,8],[1,9,1,10],[24,4,24,5],[24,6,24,7],[24,8,24,9],[24,10,24,11]]}
[]
[null,null,"Saved APPC Inputs",{"$f":"'Inputs&Summary'!D105","v":2013},null,{"$f":"'Inputs&Summary'!F105","v":2018},null,{"$f":"'Inputs&Summary'!H105","v":2023},null,{"$f":"'Inputs&Summary'!J105","v":2028},null,null,"State",{"$f":"'Inputs&Summary'!$D$15","v":"CERC"}]
[null,null,"State","APPC","Rate of Change","APPC","Rate of Change","APPC","Rate of Change","APPC","Rate of Change",null,"Technology",{"$f":"'Inputs&Summary'!$D$16","v":"Solar PV"}]
[null,null,"CERC",3.38,0.04,4.1122868101120007,0.03,4.7672674850486887,0.03,5.5265696006703067,0.03,null,"Project Year",{"$f":"'Inputs&Summary'!$D$14","v":2014}]
[null,null,"Andhra Pradesh",3.5,0.04,{"$f":"D5*(1+E5)^(F$2-D$2)","v":4.2582851584000014},0.03,{"$f":"F5*(1+G5)^(H$2-F$2)","v":4.9365195851095898},0.03,{"$f":"H5*(1+I5)^(J$2-H$2)","v":5.7227791722917392},0.03]
[null,null,"Bihar",3.38,0.04,4.1122868101120007,0.03,4.7672674850486887,0.03,5.5265696006703067,0.03,null,"Solar","Solar PV","Solar Thermal"]
[null,null,"Chhattisgarh",3,0.04,3.649958707200001,0.03,4.2313025015225056,0.03,4.9052392905357767,0.03,null,"Non-Solar","Wind","Small Hydro","Biogas","Bagasse","Biomass Gasifier","Biomass Rankine Cycle"]
[null,null,"Gujarat",2.98,0.04,3.6256256491520009,0.03,4.2030938181790223,0.03,4.8725376952655379,0.03]
{"$rows_left_out":70}
{"sheet":"Inputs","index":5,"n_rows":128,"n_cols":26,"rows_kept":128,"cut":false,"hidden":false,"merged":[[0,20,0,21],[0,22,0,23],[0,24,0,25],[0,18,0,19],[0,14,0,15],[0,16,0,17],[0,4,0,5],[0,6,0,7],[0,8,0,9],[0,10,0,11],[0,12,0,13]]}
[null,null,"Default Project Start Year",2014,"Solar PV",null,"Solar-Thermal",null,"Wind",null,"Small Hydro",null,"Biogas",null,"Bagasse",null,"Biomass Gasifier",null,"Biomass Rankine Cycle",null,"Off-grid Solar PV",null,"Off-grid Small Hydro",null,"Off-grid Biomass Gasifier"]
[null,null,"Power Generation"]
[null,"No","Input","Unit","Value","Default","Value","Default","Value","Default","Value","Default","Value","Default","Value","Default","Value","Default","Value","Default","Value","Default","Value","Default","Value","Default"]
[null,1,"Capacity ","MW",1,{"$f":"E4","v":1},10,{"$f":"G4","v":10},1,{"$f":"I4","v":1},1,{"$f":"K4","v":1},1,{"$f":"M4","v":1},1,{"$f":"O4","v":1},1,{"$f":"Q4","v":1},1,{"$f":"S4","v":1},{"$f":"Generation_Distribution!$C$61","v":1.8800000000000001E-2},0.01,{"$f":"Generation_Distribution!$E$61","v":9.7900000000000018E-3},0.01,{"$f":"Generation_Distribution!$D$61","v":1.0999999999999999E-2},3.2000000000000001E-2]
[null,{"$f":"B4+1","v":2},"Capacity Utilization Factor (CUF)/Plant Load Factor (PLF)","%",0.19,0.19,0.23,0.23,0.25,0.25,{"$f":"IF(OR('Inputs&Summary'!$D$15=\"Himachal Pradesh\",'Inputs&Summary'!$D$15=\"Uttarakhand\",'Inputs&Summary'!$D$15=\"North Eastern States\"),45%,30%)","v":0.3},{"$f":"IF(OR('Inputs&Summary'!$D$15=\"Himachal Pradesh\",'Inputs&Summary'!$D$15=\"Uttarakhand\",'Inputs&Summary'!$D$15=\"North Eastern States\"),45%,30%)","v":0.3},0.9,0.9,{"$f":"IF(OR(StateIP=\"Uttar Pradesh\",StateIP=\"Andhra Pradesh\"),45%,IF(OR(StateIP=\"Tamil Nadu\",StateIP=\"Maharashtra\"),60%,53%))","v":0.53},{"$f":"IF(OR(StateIP=\"Uttar Pradesh\",StateIP=\"Andhra Pradesh\"),45%,IF(OR(StateIP=\"Tamil Nadu\",StateIP=\"Maharashtra\"),60%,53%))","v":0.53},0.85,0.85,0.65,0.65,{"$f":"Generation_Distribution!$C$68","v":0.13364361702127658},0.17,{"$f":"Generation_Distribution!$E$68","v":0.51327885597548517},0.3,{"$f":"Generation_Distribution!$D$68","v":0.45681818181818185},0.19]
[null,3,"Annual Gross Generation ","Lakh kWhs",{"$f":"(E4*1000*8760*E5)/10^5","v":16.643999999999998},{"$f":"(F4*1000*8760*F5)/10^5","v":16.643999999999998},{"$f":"(G4*1000*8760*G5)/10^5","v":201.48},201.48,{"$f":"(I4*1000*8760*I5)/10^5","v":21.9},21.9,{"$f":"(K4*1000*8760*K5)/10^5","v":26.28},{"$f":"(L4*1000*8760*L5)/10^5","v":26.28},{"$f":"(M4*1000*8760*M5)/10^5","v":78.84},78.84,{"$f":"(O4*1000*8760*O5)/10^5","v":46.427999999999997},{"$f":"(P4*1000*8760*P5)/10^5","v":46.427999999999997},{"$f":"(Q4*1000*8760*Q5)/10^5","v":74.459999999999994},74.459999999999994,56.94,56.94,{"$f":"(U4*1000*8760*U5)/10^5","v":0.22009499999999996},0.14892000000000002,{"$f":"(W4*1000*8760*W5)/10^5","v":0.44019000000000008},0.26279999999999998,{"$f":"(Y4*1000*8760*Y5)/10^5","v":0.44019000000000003},0.53260800000000008]
[null,4,"Auxiliary consumption","%",0,0,0.1,0.1,0,0,0.01,0.01,0.12,0.12,8.5000000000000006E-2,8.5000000000000006E-2,0.1,0.1,0.1,0.1,0,0,0.01,0.01,0.1,0.1]
[null,5,"Annual Net Generation ","Lakh kWhs",{"$f":"E6*(1-E7)","v":16.643999999999998},{"$f":"F6*(1-F7)","v":16.643999999999998},{"$f":"G6*(1-G7)","v":181.33199999999999},181.33199999999999,{"$f":"I6*(1-I7)","v":21.9},21.9,{"$f":"K6*(1-K7)","v":26.017200000000003},{"$f":"L6*(1-L7)","v":26.017200000000003},{"$f":"M6*(1-M7)","v":69.379199999999997},69.379199999999997,{"$f":"O6*(1-O7)","v":42.481619999999999},{"$f":"P6*(1-P7)","v":42.481619999999999},{"$f":"Q6*(1-Q7)","v":67.013999999999996},67.013999999999996,51.246000000000002,51.246000000000002,{"$f":"U6*(1-U7)","v":0.22009499999999996},0.14892000000000002,{"$f":"W6*(1-W7)","v":0.43578810000000007},0.26017199999999996,{"$f":"Y6*(1-Y7)","v":0.39617100000000005},0.47934720000000008]
{"$rows_left_out":121}
{"sheet":"Introduction","index":6,"n_rows":35,"n_cols":15,"rows_kept":35,"cut":false,"hidden":false,"merged":[]}
[]
[]
[]
[]
[]
[]
[]
[]
{"$rows_left_out":28}
{"sheet":"Inputs&Summary","index":7,"n_rows":139,"n_cols":16,"rows_kept":139,"cut":false,"hidden":false,"merged":[[104,9,104,10],[104,7,104,8],[104,5,104,6],[104,3,104,4],[0,0,0,5],[0,8,0,12],[16,3,16,5],[18,3,18,4],[15,3,15,5],[14,3,14,5],[17,3,17,5]]}
["Renewable Energy Tariff and Financial Analysis Tool",null,null,null,null,null,null,null,"Developed by Prayas Energy Group"]
[]
[null,null,null,null,null,null,null,null,"Outputs",{"$f":"IF($D$19=Lookup_Tables!F35,\"CERC Cost of Generation\",\"Delivered cost of Off-grid Power \")","v":"CERC Cost of Generation"},{"$f":"IF($D$19=Lookup_Tables!F35,\"CERC Cost of Generation with AD\",\"Delivered cost of Off-grid power With AD\")","v":"CERC Cost of Generation with AD"},{"$f":"IF($D$19=Lookup_Tables!F35,\"FIT Provided by User\",\"Grid Extension: Single Phase\")","v":"FIT Provided by User"},{"$f":"IF($D$19=Lookup_Tables!F35,\"Based on RECs\",\"Grid Extension: Three Phase\")","v":"Based on RECs"}]
[null,null,null,0.25,null,null,null,null,{"$f":"Tariff!B45","v":"Levelized Tariff"},{"$f":"Tariff!$C$45","v":7.7180943790021699},{"$f":"Tariff!$C$46","v":6.9680733378354143},{"$f":"IF($D$19=Lookup_Tables!F35,Tariff!$C$61,Grid_Extension_Cost!C56)","v":11.159999999999989},{"$f":"IF($D$19=Lookup_Tables!F35,Tariff!$C$63,Grid_Extension_Cost!C40)","v":8.9952315904922973}]
[null,null,null,null,null,null,null,null,{"$f":"IF($D$19=Lookup_Tables!F35,DSCR!$B$19,\"\")","v":"Average DSCR"},{"$f":"IF($D$19=Lookup_Tables!F35,DSCR!$C$19,\"\")","v":1.4764352525317752},{"$f":"IF($D$19=Lookup_Tables!F35,DSCR!$C$23,\"\")","v":1.3260288887321374},{"$f":"IF($D$19=Lookup_Tables!F35,DSCR!$C$28,\"\")","v":2.1563884746766906},{"$f":"IF($D$19=Lookup_Tables!F35,DSCR!$C$33,\"\")","v":1.7358929710614948}]
[null,null,null,null,null,null,null,null,{"$f":"IF($D$19=Lookup_Tables!F35,DSCR!$B$18,\"\")","v":"MINIMUM DSCR (after 1st year)"},{"$f":"IF($D$19=Lookup_Tables!F35,DSCR!$C$18,\"\")","v":1.0615815930305506},{"$f":"IF($D$19=Lookup_Tables!F35,DSCR!$C$22,\"\")","v":0.96089749032673222},{"$f":"IF($D$19=Lookup_Tables!F35,DSCR!$C$27,\"\")","v":1.5236288690673645},{"$f":"IF($D$19=Lookup_Tables!F35,DSCR!$C$32,\"\")","v":1.2974584459396252}]
[null,null,null,null,null,null,null,null,{"$f":"IF($D$19=Lookup_Tables!F35,\"Project IRR-Post Tax\",\"\")","v":"Project IRR-Post Tax"},{"$f":"IF($D$19=Lookup_Tables!F35,IRR!$C$42,\"\")","v":0.13490263772128874},{"$f":"IF($D$19=Lookup_Tables!F35,IRR!$C$51,\"\")","v":0.13463007468873389},{"$f":"IF($D$19=Lookup_Tables!F35,IRR!$C$58,\"\")","v":0.20856750015143444},{"$f":"IF($D$19=Lookup_Tables!F35,IRR!$C$65,\"\")","v":0.16622128278806247}]
[null,null,null,null,null,null,null,null,{"$f":"IF($D$19=Lookup_Tables!F35,\"Equity IRR-Post Tax\",\"\")","v":"Equity IRR-Post Tax"},{"$f":"IF($D$19=Lookup_Tables!F35,IRR!$C$75,\"\")","v":0.14893645351745821},{"$f":"IF($D$19=Lookup_Tables!F35,IRR!$C$82,\"\")","v":0.15431158601697925},{"$f":"IF($D$19=Lookup_Tables!F35,IRR!$C$88,\"\")","v":0.31603138253448049},{"$f":"IF($D$19=Lookup_Tables!F35,IRR!$C$94,\"\")","v":0.21794040357711641}]
{"$rows_left_out":132}
{"sheet":"Scenarios","index":8,"n_rows":101,"n_cols":14,"rows_kept":101,"cut":false,"hidden":false,"merged":[]}
[]
[null,null,null,null,"Scenario 1","Scenario 2","Scenario 3","Scenario 4","Scenario 5","Scenario 6","Scenario 7","Scenario 8","Scenario 9","Scenario 10"]
[null,null,null,"Year →"]
[null,"No","Output","State →"]
[null,null,"RoE-based FIT w/o AD","Tech →"]
[null,1,"Levelized Tariff","Rs/unit"]
[null,{"$f":"B6+1","v":2},"Average DSCR","Rs"]
[null,{"$f":"B7+1","v":3},"MINIMUM DSCR (after 1st year)","Rs"]
{"$rows_left_out":94}
{"sheet":"Off-Grid Sensitivity","index":12,"n_rows":40,"n_cols":6,"rows_kept":40,"cut":false,"hidden":false,"merged":[]}
[]
[]
[]
[]
[]
[]
[]
[]
{"$rows_left_out":33}
{"sheet":"Sensitivity","index":13,"n_rows":19,"n_cols":14,"rows_kept":19,"cut":false,"hidden":false,"merged":[[3,9,3,15],[1,2,1,11]]}
[]
[null,null,"Sensitivity of Tariff Outcome with Change in different inputs"]
[]
[null,"Input","Units","Enabled","Base","Min","Max","Min %","Max %"]
[null,{"$f":"'Inputs&Summary'!C41","v":"CapEx per MW"},{"$f":"'Inputs&Summary'!F41","v":"Rs Lacs/MW"},"N",{"$f":"'Inputs&Summary'!D41","v":691},587.35,794.65,{"$f":"IF(D5=\"Y\",(F5-E5)/E5,\"\")","v":""},{"$f":"IF(D5=\"Y\",(G5-E5)/E5,\"\")","v":""}]
[null,{"$f":"'Inputs&Summary'!C42","v":"O&M cost"},{"$f":"'Inputs&Summary'!F42","v":"Rs Lacs / MW"},"Y",{"$f":"'Inputs&Summary'!D42","v":12.3},10.455,14.145,{"$f":"IF(D6=\"Y\",(F6-E6)/E6,\"\")","v":-0.15000000000000005},{"$f":"IF(D6=\"Y\",(G6-E6)/E6,\"\")","v":0.14999999999999991},7.2446822582506476,7.3205398653635623,7.3963974724764761,7.4722550795893907,7.5481126867023045]
[null,"PLF/CUF",{"$f":"'Inputs&Summary'!F35","v":"%"},"Y",{"$f":"'Inputs&Summary'!D35","v":0.19},0.1615,0.21849999999999997,-0.15,0.14999999999999983,7.4598968474739653,7.4255728609888365,7.3963974724764761,7.3774590623895069,7.3604144933112323]
[null,{"$f":"'Inputs&Summary'!C50","v":"Loan 1 Interest Rate"},{"$f":"'Inputs&Summary'!F50","v":"%"},"N",{"$f":"'Inputs&Summary'!D50","v":0.127},0.10795,0.14604999999999999,"",""]
{"$rows_left_out":12}
{"sheet":"REC-FIT","index":14,"n_rows":47,"n_cols":42,"rows_kept":47,"cut":false,"hidden":false,"merged":[[1,1,1,3],[11,2,11,3],[11,4,11,5],[11,6,11,7],[11,8,11,9]]}
[]
[null,"Renewable Energy Certificates"]
[]
[null,"User Input","Value","Units"]
[null,"State",{"$f":"StateIP","v":"CERC"}]
[null,"Technology",{"$f":"TechnologyIP","v":"Solar PV"}]
[null,"Project Start Year",{"$f":"'Inputs&Summary'!D14","v":2014},"-"]
[null,{"$f":"'Inputs&Summary'!C40","v":"Life of Plant and Machinery / Project Life"},{"$f":"'Inputs&Summary'!D40","v":25},{"$f":"'Inputs&Summary'!F40","v":"years"}]
{"$rows_left_out":40}
{"sheet":"Term Loan 1","index":15,"n_rows":57,"n_cols":42,"rows_kept":57,"cut":false,"hidden":false,"merged":[[1,8,1,11]]}
[]
[null,null,null,null,null,null,null,null,"Term Loan Payments"]
[null,"Inputs","Value","Units"]
[null,"State",{"$f":"StateIP","v":"CERC"}]
[null,"Technology",{"$f":"TechnologyIP","v":"Solar PV"}]
[null,"Project Start Year",{"$f":"'Inputs&Summary'!D14","v":2014},"-"]
[null,"Loan amount",{"$f":"'Inputs&Summary'!D48-'Inputs&Summary'!D54","v":483.7},{"$f":"'Inputs&Summary'!F48","v":"Rs lacs"}]
[null,"Interest Rate",{"$f":"'Inputs&Summary'!D50","v":0.127},{"$f":"'Inputs&Summary'!F50","v":"%"}]
{"$rows_left_out":50}
{"sheet":"Term Loan 2","index":16,"n_rows":119,"n_cols":42,"rows_kept":119,"cut":false,"hidden":false,"merged":[[1,8,1,11]]}
[]
[null,null,null,null,null,null,null,null,"Term Loan Payments"]
[null,"Inputs","Value","Units"]
[null,"State",{"$f":"StateIP","v":"CERC"}]
[null,"Technology",{"$f":"TechnologyIP","v":"Solar PV"}]
[null,"Project Start Year",{"$f":"'Inputs&Summary'!D14","v":2014},"-"]
[null,"Loan amount",{"$f":"'Inputs&Summary'!D54","v":0},{"$f":"'Inputs&Summary'!F54","v":"Rs lacs"}]
[null,"Interest Rate",{"$f":"'Inputs&Summary'!D55","v":0.1},{"$f":"'Inputs&Summary'!F55","v":"%"}]
{"$rows_left_out":112}
{"sheet":"Fuel","index":17,"n_rows":22,"n_cols":43,"rows_kept":22,"cut":false,"hidden":false,"merged":[[1,10,1,13]]}
[]
[null,null,null,null,null,null,null,null,null,null,"Fuel"]
[null,"Inputs","Value","Units"]
[null,"State",{"$f":"StateIP","v":"CERC"}]
[null,"Technology",{"$f":"TechnologyIP","v":"Solar PV"}]
[null,"Project Start Year",{"$f":"'Inputs&Summary'!D14","v":2014},"-"]
[null,"Annual Derated Capacity",{"$f":"'Inputs&Summary'!D39","v":0},{"$f":"'Inputs&Summary'!F39","v":"%"}]
[null,"1st Year Gross Generation",{"$f":"'Inputs&Summary'!D36","v":16.643999999999998},{"$f":"'Inputs&Summary'!F36","v":"Lakh kWhs"}]
{"$rows_left_out":15}
{"sheet":"Depreciation","index":18,"n_rows":52,"n_cols":42,"rows_kept":52,"cut":false,"hidden":false,"merged":[[1,4,1,14]]}
[]
[null,null,null,null,"Depreciation"]
[null,"Inputs","Value","Unit"]
[null,"State",{"$f":"StateIP","v":"CERC"}]
[null,"Technology",{"$f":"TechnologyIP","v":"Solar PV"}]
[null,"Project Start Year",{"$f":"'Inputs&Summary'!D14","v":2014},"-"]
[null,"CapEx",{"$f":"'Inputs&Summary'!D41*'Inputs&Summary'!D34","v":691},"Rs Lacs"]
[null,"Project Capitalized during 2nd half of Financial Year","Yes","Yes/No"]
{"$rows_left_out":45}
{"sheet":"W Capital","index":19,"n_rows":20,"n_cols":42,"rows_kept":20,"cut":false,"hidden":false,"merged":[[1,9,1,12]]}
[]
[null,null,null,null,null,null,null,null,null,"Working Capital"]
[null,"Inputs","Value","Units"]
[null,"State",{"$f":"StateIP","v":"CERC"}]
[null,"Technology",{"$f":"TechnologyIP","v":"Solar PV"}]
[null,"Project Start Year",{"$f":"'Inputs&Summary'!D14","v":2014},"-"]
[null,{"$f":"'Inputs&Summary'!C34","v":"Capacity "},{"$f":"'Inputs&Summary'!D34","v":1},{"$f":"'Inputs&Summary'!F34","v":"MW"}]
[null,{"$f":"'Inputs&Summary'!C40","v":"Life of Plant and Machinery / Project Life"},{"$f":"'Inputs&Summary'!D40","v":25},{"$f":"'Inputs&Summary'!F40","v":"years"}]
{"$rows_left_out":13}
{"sheet":"Tariff","index":20,"n_rows":66,"n_cols":43,"rows_kept":66,"cut":false,"hidden":false,"merged":[[1,9,1,12]]}
[]
[null,null,null,null,null,null,null,null,null,"Tariff Calculations"]
[null,"Inputs","Value","Units"]
[null,"State",{"$f":"StateIP","v":"CERC"}]
[null,"Technology",{"$f":"TechnologyIP","v":"Solar PV"}]
[null,"Project Start Year",{"$f":"'Inputs&Summary'!D14","v":2014},"-"]
[null,{"$f":"'Inputs&Summary'!C34","v":"Capacity "},{"$f":"'Inputs&Summary'!D34","v":1},{"$f":"'Inputs&Summary'!F34","v":"MW"}]
[null,{"$f":"'Inputs&Summary'!C38","v":"Annual Net Generation "},{"$f":"'Inputs&Summary'!D38","v":16.643999999999998},{"$f":"'Inputs&Summary'!F38","v":"Lakh kWhs"}]
{"$rows_left_out":59}
{"sheet":"Carbon","index":21,"n_rows":23,"n_cols":42,"rows_kept":23,"cut":false,"hidden":false,"merged":[[0,6,0,8]]}
[null,null,null,null,null,null,"Carbon Credits"]
[]
[null,"Inputs","Value","Units"]
[null,"State",{"$f":"StateIP","v":"CERC"}]
[null,"Technology",{"$f":"TechnologyIP","v":"Solar PV"}]
[null,"Emission factor ",{"$f":"'Inputs&Summary'!D101","v":0.9},"Ton CO2 / MWh"]
[null,"Discount Rate",{"$f":"'Inputs&Summary'!D89","v":0.10668289},"%"]
[null,"Cumulative Generation in 10 yrs",{"$f":"SUM(Tariff!C28:L28)/10000","v":1.6644000000000003E-2},"Million MWh"]
{"$rows_left_out":16}
{"sheet":"Profit Loss","index":22,"n_rows":95,"n_cols":42,"rows_kept":95,"cut":false,"hidden":false,"merged":[[1,7,1,12]]}
[]
[null,null,null,null,null,null,null,"Profit Loss Statement"]
[null,"Inputs","Value","Units"]
[null,"State",{"$f":"StateIP","v":"CERC"}]
[null,"Technology",{"$f":"TechnologyIP","v":"Solar PV"}]
[null,"Project Start Year",{"$f":"'Inputs&Summary'!D14","v":2014},"-"]
[null,{"$f":"'Inputs&Summary'!C49","v":"Equity"},{"$f":"'Inputs&Summary'!D49","v":207.3},{"$f":"'Inputs&Summary'!F49","v":"Rs lacs"}]
[null,{"$f":"'Inputs&Summary'!C40","v":"Life of Plant and Machinery / Project Life"},{"$f":"'Inputs&Summary'!D40","v":25},{"$f":"'Inputs&Summary'!F40","v":"years"}]
{"$rows_left_out":88}
{"sheet":"Cash Flows","index":23,"n_rows":45,"n_cols":43,"rows_kept":45,"cut":false,"hidden":false,"merged":[[1,12,1,14]]}
[]
[null,null,null,null,null,null,null,null,null,null,null,null,"Cash Flows"]
[null,"User Inputs","Value","Units"]
[null,"State",{"$f":"StateIP","v":"CERC"}]
[null,"Technology",{"$f":"TechnologyIP","v":"Solar PV"}]
[null,"Project Start Year",{"$f":"'Inputs&Summary'!D14","v":2014},"-"]
[null,"Project Cost",{"$f":"'Inputs&Summary'!$D$41*'Inputs&Summary'!$D$34","v":691},"Rs Lacs"]
[null,{"$f":"'Inputs&Summary'!C40","v":"Life of Plant and Machinery / Project Life"},{"$f":"'Inputs&Summary'!$D$40","v":25},{"$f":"'Inputs&Summary'!F40","v":"years"}]
{"$rows_left_out":38}
{"sheet":"Balance Sheet","index":24,"n_rows":56,"n_cols":43,"rows_kept":56,"cut":false,"hidden":false,"merged":[[1,10,1,13]]}
[]
[null,null,null,null,null,null,null,null,null,null,"Balance Sheet (Rs Lacs)"]
[null,"User Inputs","Value","Units"]
[null,"State",{"$f":"StateIP","v":"CERC"}]
[null,"Technology",{"$f":"TechnologyIP","v":"Solar PV"}]
[null,"Project Start Year",{"$f":"'Inputs&Summary'!D14","v":2014},"-"]
[null,"Project Cost",{"$f":"'Inputs&Summary'!$D$41*'Inputs&Summary'!$D$34","v":691},"Rs Lacs"]
[null,{"$f":"'Inputs&Summary'!C40","v":"Life of Plant and Machinery / Project Life"},{"$f":"'Inputs&Summary'!D40","v":25},{"$f":"'Inputs&Summary'!F40","v":"years"}]
{"$rows_left_out":49}
{"sheet":"IRR","index":25,"n_rows":95,"n_cols":43,"rows_kept":95,"cut":false,"hidden":false,"merged":[[1,6,1,9]]}
[]
[null,null,null,null,null,null,"IRR Analysis"]
[null,"User Inputs","Value","Units"]
[null,"State",{"$f":"StateIP","v":"CERC"}]
[null,"Technology",{"$f":"TechnologyIP","v":"Solar PV"}]
[null,"Project Start Year",{"$f":"'Inputs&Summary'!D14","v":2014},"-"]
[null,"Project Cost",{"$f":"'Inputs&Summary'!D41*'Inputs&Summary'!D34","v":691},"Rs Lacs"]
[null,"Equity",{"$f":"'Inputs&Summary'!D49","v":207.3},{"$f":"'Inputs&Summary'!F49","v":"Rs lacs"}]
{"$rows_left_out":88}
{"sheet":"DSCR","index":26,"n_rows":33,"n_cols":43,"rows_kept":33,"cut":false,"hidden":false,"merged":[[1,7,1,11]]}
[]
[null,null,null,null,null,null,null,"Debt Service Coverage Ratio"]
[]
[null,"Inputs","Value"]
[null,"State",{"$f":"StateIP","v":"CERC"}]
[null,"Technology",{"$f":"TechnologyIP","v":"Solar PV"}]
[]
[null,"Debt Service Coverage Ratio Calculations","Yr0",{"$f":"'Inputs&Summary'!D14","v":2014},{"$f":"D8+1","v":2015},{"$f":"E8+1","v":2016},2017,2018,2019,2020,2021,2022,2023,2024,2025,2026,2027,2028,2029,2030,2031,2032,2033,2034,2035,2036,2037,2038,2039,2040,2041,2042,2043,2044,2045,2046,2047,2048,2049,2050,2051,2052,2053]
{"$rows_left_out":25}